Latest Posts

Topic: Build 3914 Broken

Magor
Joined: 2009-03-30, 07:38
Posts: 36
Ranking
Pry about Widelands
Location: Königswinter, Germany
Posted at: 2009-04-26, 14:11

Someone broke (at least) the builds 3912 and 3914:

Running tests in build/native-debug/economy/test/test_economy

Running 17 test cases...

src/economy/test/test_routing.cc(342): error in "router_findroute_connectedNodes_exceptSuccess": check rval == true failed [0!= 1]

src/economy/test/test_routing.cc(464): error in "find_long_route": check rval == true failed [0 != 1]

src/economy/test/test_routing.cc(470): error in "find_long_route": check route.has_chain(chain) failed

*** 3 failures detected in test suite "Economy"

scons: *** [build/native-debug/economy/test/test_economy.passed] Error 1

scons: building terminated because of errors.

make: *** [warning] Fehler 2

Yours, Magor


Top Quote
SirVer
Joined: 2009-02-19, 15:18
Posts: 1438
Ranking
One Elder of Players
Location: Germany - Munich
Posted at: 2009-04-26, 15:03

Discussion continued here:

https://sourceforge.net/tracker/?func=detail&atid=427221&aid=2781604&group_id=40163


Top Quote